Reaction Details
TargetHistamine H3 receptor
LigandBDBM50372314
Substrate/Competitorn/a
Meas. Tech.ChEMBL_464863 (CHEMBL930580)
Ki>340±n/a nM
Citation Nersesian, DLBlack, LAMiller, TRVortherms, TAEsbenshade, TAHancock, AACowart, MD In vitro SAR of pyrrolidine-containing histamine H3 receptor antagonists: trends across multiple chemical series. Bioorg Med Chem Lett18:355-9 (2008) 
 
Histamine H3 receptor
Name:Histamine H3 receptor
Type:G Protein-Coupled Receptor (GPCR)
Mol. Mass.:48607.98
Organism:Rattus norvegicus (rat)
Description:n/a
Residue:445
BDBM50372314
NameBDBM50372314
Synonyms:CHEMBL257912
TypeSmall organic molecule
Emp. Form.C13H19N
Mol. Mass.189.2967
SMILESCc1ccc(CCN2CCCC2)cc1