Reaction Details
TargetHistamine H3 receptor
LigandBDBM50372315
Substrate/Competitorn/a
Meas. Tech.ChEMBL_464862 (CHEMBL930579)
Ki 32±n/a nM
Citation Nersesian, DLBlack, LAMiller, TRVortherms, TAEsbenshade, TAHancock, AACowart, MD In vitro SAR of pyrrolidine-containing histamine H3 receptor antagonists: trends across multiple chemical series. Bioorg Med Chem Lett18:355-9 (2008) 
 
Histamine H3 receptor
Name:Histamine H3 receptor
Type:G Protein-Coupled Receptor (GPCR)
Mol. Mass.:48691.47
Organism:Homo sapiens (Human)
Description:Binding assays were using CHO cells stably expressing hH3R receptors.
Residue:445
BDBM50372315
NameBDBM50372315
Synonyms:CHEMBL257914
TypeSmall organic molecule
Emp. Form.C14H21N
Mol. Mass.203.3232
SMILESC[C@H]1CCCN1CCc1cccc(C)c1