Reaction Details
TargetHistamine H3 receptor
LigandBDBM50372328
Substrate/Competitorn/a
Meas. Tech.ChEMBL_464863 (CHEMBL930580)
Ki 260±n/a nM
Citation Nersesian, DLBlack, LAMiller, TRVortherms, TAEsbenshade, TAHancock, AACowart, MD In vitro SAR of pyrrolidine-containing histamine H3 receptor antagonists: trends across multiple chemical series. Bioorg Med Chem Lett18:355-9 (2008) 
 
Histamine H3 receptor
Name:Histamine H3 receptor
Type:G Protein-Coupled Receptor (GPCR)
Mol. Mass.:48607.98
Organism:Rattus norvegicus (rat)
Description:n/a
Residue:445
BDBM50372328
NameBDBM50372328
Synonyms:CHEMBL257913
TypeSmall organic molecule
Emp. Form.C13H19NO
Mol. Mass.205.2961
SMILESCOc1ccccc1CCN1CCCC1