Reaction Details
TargetD(1A) dopamine receptor
LigandBDBM50212239
Substrate/Competitorn/a
Meas. Tech.ChEMBL_466541 (CHEMBL928139)
IC50 7000±n/a nM
Citation Jarvis, MFHonore, PShieh, CCChapman, MJoshi, SZhang, XFKort, MCarroll, WMarron, BAtkinson, RThomas, JLiu, DKrambis, MLiu, YMcGaraughty, SChu, KRoeloffs, RZhong, CMikusa, JPHernandez, GGauvin, DWade, CZhu, CPai, MScanio, MShi, LDrizin, IGregg, RMatulenko, MHakeem, AGross, MJohnson, MMarsh, KWagoner, PKSullivan, JPFaltynek, CRKrafte, DS A-803467, a potent and selective Nav1.8 sodium channel blocker, attenuates neuropathic and inflammatory pain in the rat. Proc Natl Acad Sci U S A104:8520-5 (2007) 
 
D(1A) dopamine receptor
Name:D(1A) dopamine receptor
Type:Enzyme
Mol. Mass.:49303.43
Organism:Homo sapiens (Human)
Description:P21728
Residue:446
BDBM50212239
NameBDBM50212239
Synonyms:5-(4-chlorophenyl)-N-(3,5-dimethoxyphenyl)furan-2-carboxamide CHEMBL250699
TypeSmall organic molecule
Emp. Form.C19H16ClNO4
Mol. Mass.357.788
SMILESCOc1cc(NC(=O)c2ccc(o2)-c2ccc(Cl)cc2)cc(OC)c1