Reaction Details
TargetAndrogen receptor
LigandBDBM18161
Substrate/Competitorn/a
Meas. Tech.ChEMBL_467614 (CHEMBL930489)
EC50 5.1±n/a nM
Citation Zhao, SShen, Yvan Oeveren, AMarschke, KBZhi, L Discovery of a novel series of nonsteroidal androgen receptor modulators: 5- or 6-oxachrysen-2-ones. Bioorg Med Chem Lett18:3431-5 (2008) 
 
Androgen receptor
Name:Androgen receptor
Type:Receptor
Mol. Mass.:99185.27
Organism:Homo sapiens (Human)
Description:CHO cells were stably transfected with human AR gene.
Residue:920
BDBM18161
NameBDBM18161
Synonyms:(1S,2S,7S,10R,11S,14S,15S)-14-hydroxy-2,15-dimethyltetracyclo[8.7.0.0^{2,7}.0^{11,15}]heptadecan-5-one CHEMBL27769 Dihydrotestosterone | [3H]DHT
TypeSteroid
Emp. Form.C19H30O2
Mol. Mass.290.4403
SMILES[H][C@@]12CC[C@H](O)[C@@]1(C)CC[C@@]1([H])[C@@]2([H])CC[C@@]2([H])CC(=O)CC[C@]12C