Reaction Details
TargetEnoyl-[acyl-carrier-protein] reductase [NADH]
LigandBDBM50373347
Substrate/Competitorn/a
Meas. Tech.ChEMBL_467653 (CHEMBL936676)
Ki 1.000±n/a nM
Citation am Ende, CWKnudson, SELiu, NChilds, JSullivan, TJBoyne, MXu, HGegina, YKnudson, DLJohnson, FPeloquin, CASlayden, RATonge, PJ Synthesis and in vitro antimycobacterial activity of B-ring modified diaryl ether InhA inhibitors. Bioorg Med Chem Lett18:3029-33 (2008) 
 
Enoyl-[acyl-carrier-protein] reductase [NADH]
Name:Enoyl-[acyl-carrier-protein] reductase [NADH]
Type:Enzyme
Mol. Mass.:28526.00
Organism:Mycobacterium tuberculosis (strain ATCC 25618 / H37Rv)
Description:P9WGR1
Residue:269
BDBM50373347
NameBDBM50373347
Synonyms:CHEMBL264175 | PT15
TypeSmall organic molecule
Emp. Form.C18H23NO2
Mol. Mass.285.3807
SMILESCCCCCCc1ccc(Oc2ccc(N)cc2)c(O)c1