Reaction Details
TargetEnoyl-[acyl-carrier-protein] reductase [NADH]
LigandBDBM50373340
Substrate/Competitorn/a
Meas. Tech.ChEMBL_467649 (CHEMBL936672)
IC50 130±n/a nM
Citation am Ende, CWKnudson, SELiu, NChilds, JSullivan, TJBoyne, MXu, HGegina, YKnudson, DLJohnson, FPeloquin, CASlayden, RATonge, PJ Synthesis and in vitro antimycobacterial activity of B-ring modified diaryl ether InhA inhibitors. Bioorg Med Chem Lett18:3029-33 (2008) 
 
Enoyl-[acyl-carrier-protein] reductase [NADH]
Name:Enoyl-[acyl-carrier-protein] reductase [NADH]
Type:Enzyme
Mol. Mass.:28526.00
Organism:Mycobacterium tuberculosis (strain ATCC 25618 / H37Rv)
Description:P9WGR1
Residue:269
BDBM50373340
NameBDBM50373340
Synonyms:CHEMBL260399
TypeSmall organic molecule
Emp. Form.C22H24N2O4
Mol. Mass.380.437
SMILESCCCCCCc1ccc(Oc2ccc(NC(=O)c3ccno3)cc2)c(O)c1