Reaction Details
TargetEnoyl-[acyl-carrier-protein] reductase [NADH]
LigandBDBM8726
Substrate/Competitorn/a
Meas. Tech.ChEMBL_467653 (CHEMBL936676)
Ki 200±n/a nM
Citation am Ende, CWKnudson, SELiu, NChilds, JSullivan, TJBoyne, MXu, HGegina, YKnudson, DLJohnson, FPeloquin, CASlayden, RATonge, PJ Synthesis and in vitro antimycobacterial activity of B-ring modified diaryl ether InhA inhibitors. Bioorg Med Chem Lett18:3029-33 (2008) 
 
Enoyl-[acyl-carrier-protein] reductase [NADH]
Name:Enoyl-[acyl-carrier-protein] reductase [NADH]
Type:Enzyme
Mol. Mass.:28526.00
Organism:Mycobacterium tuberculosis (strain ATCC 25618 / H37Rv)
Description:P9WGR1
Residue:269
BDBM8726
NameBDBM8726
Synonyms:5-chloro-2-(2,4-dichlorophenoxy)phenol TCL US20230414581, Compound 35
TypeSmall organic molecule
Emp. Form.C12H7Cl3O2
Mol. Mass.289.542
SMILESOc1cc(Cl)ccc1Oc1ccc(Cl)cc1Cl