Reaction Details
TargetEnoyl-[acyl-carrier-protein] reductase [NADH]
LigandBDBM50373335
Substrate/Competitorn/a
Meas. Tech.ChEMBL_467649 (CHEMBL936672)
IC50 8200±n/a nM
Citation am Ende, CWKnudson, SELiu, NChilds, JSullivan, TJBoyne, MXu, HGegina, YKnudson, DLJohnson, FPeloquin, CASlayden, RATonge, PJ Synthesis and in vitro antimycobacterial activity of B-ring modified diaryl ether InhA inhibitors. Bioorg Med Chem Lett18:3029-33 (2008) 
 
Enoyl-[acyl-carrier-protein] reductase [NADH]
Name:Enoyl-[acyl-carrier-protein] reductase [NADH]
Type:Enzyme
Mol. Mass.:28526.00
Organism:Mycobacterium tuberculosis (strain ATCC 25618 / H37Rv)
Description:P9WGR1
Residue:269
BDBM50373335
NameBDBM50373335
Synonyms:CHEMBL258931
TypeSmall organic molecule
Emp. Form.C16H20N2O2
Mol. Mass.272.3422
SMILESCCCCCCc1ccc(Oc2ncccn2)c(O)c1