Reaction Details
TargetLysophosphatidic acid receptor 1
LigandBDBM50373817
Substrate/Competitorn/a
Meas. Tech.ChEMBL_468544 (CHEMBL930969)
IC50>50000±n/a nM
Citation Beck, HPKohn, TRubenstein, SHedberg, CSchwandner, RHasslinger, KDai, KLi, CLiang, LWesche, HFrank, BAn, SWickramasinghe, DJaen, JMedina, JHungate, RShen, W Discovery of potent LPA2 (EDG4) antagonists as potential anticancer agents. Bioorg Med Chem Lett18:1037-41 (2008) 
 
Lysophosphatidic acid receptor 1
Name:Lysophosphatidic acid receptor 1
Type:Enzyme
Mol. Mass.:41120.55
Organism:Homo sapiens (Human)
Description:Q92633
Residue:364
BDBM50373817
NameBDBM50373817
Synonyms:CHEMBL404452
TypeSmall organic molecule
Emp. Form.C21H27N5S
Mol. Mass.381.538
SMILESC[C@@H](CN1CCN(CC1)c1ccccc1C)Nc1ncnc2c(C)csc12