Reaction Details
TargetLysophosphatidic acid receptor 2
LigandBDBM50373820
Substrate/Competitorn/a
Meas. Tech.ChEMBL_468543 (CHEMBL930968)
IC50 3200±n/a nM
Citation Beck, HPKohn, TRubenstein, SHedberg, CSchwandner, RHasslinger, KDai, KLi, CLiang, LWesche, HFrank, BAn, SWickramasinghe, DJaen, JMedina, JHungate, RShen, W Discovery of potent LPA2 (EDG4) antagonists as potential anticancer agents. Bioorg Med Chem Lett18:1037-41 (2008) 
 
Lysophosphatidic acid receptor 2
Name:Lysophosphatidic acid receptor 2
Type:PROTEIN
Mol. Mass.:39103.44
Organism:Homo sapiens (Human)
Description:ChEMBL_1451385
Residue:351
BDBM50373820
NameBDBM50373820
Synonyms:CHEMBL270878
TypeSmall organic molecule
Emp. Form.C25H31N5O
Mol. Mass.417.5465
SMILESCOc1ccccc1N1CCN(C[C@H](C)Nc2nc(nc3ccccc23)C2CC2)CC1