Reaction Details
TargetLysophosphatidic acid receptor 2
LigandBDBM50373823
Substrate/Competitorn/a
Meas. Tech.ChEMBL_468543 (CHEMBL930968)
IC50>30000±n/a nM
Citation Beck, HPKohn, TRubenstein, SHedberg, CSchwandner, RHasslinger, KDai, KLi, CLiang, LWesche, HFrank, BAn, SWickramasinghe, DJaen, JMedina, JHungate, RShen, W Discovery of potent LPA2 (EDG4) antagonists as potential anticancer agents. Bioorg Med Chem Lett18:1037-41 (2008) 
 
Lysophosphatidic acid receptor 2
Name:Lysophosphatidic acid receptor 2
Type:PROTEIN
Mol. Mass.:39103.44
Organism:Homo sapiens (Human)
Description:ChEMBL_1451385
Residue:351
BDBM50373823
NameBDBM50373823
Synonyms:CHEMBL406676
TypeSmall organic molecule
Emp. Form.C24H28F3N5O
Mol. Mass.459.5072
SMILESCC[C@@H](CN1CCN(CC1)c1ccccc1OC)Nc1nc(nc2ccccc12)C(F)(F)F