Reaction Details
TargetHistone deacetylase 11
LigandBDBM50232034
Substrate/Competitorn/a
Meas. Tech.ChEMBL_468842 (CHEMBL947929)
IC50>50000±n/a nM
Citation Methot, JLChakravarty, PKChenard, MClose, JCruz, JCDahlberg, WKFleming, JHamblett, CLHamill, JEHarrington, PHarsch, AHeidebrecht, RHughes, BJung, JKenific, CMKral, AMMeinke, PTMiddleton, REOzerova, NSloman, DLStanton, MGSzewczak, AATyagarajan, SWitter, DJSecrist, JPMiller, TA Exploration of the internal cavity of histone deacetylase (HDAC) with selective HDAC1/HDAC2 inhibitors (SHI-1:2). Bioorg Med Chem Lett18:973-8 (2008) 
 
Histone deacetylase 11
Name:Histone deacetylase 11
Type:Chromatin regulator; hydrolase; repressor
Mol. Mass.:39187.66
Organism:Homo sapiens (Human)
Description:Q96DB2
Residue:347
BDBM50232034
NameBDBM50232034
Synonyms:CHEMBL256440 | N-(2-amino-5-(thiophen-2-yl)phenyl)nicotinamide
TypeSmall organic molecule
Emp. Form.C16H13N3OS
Mol. Mass.295.359
SMILESNc1ccc(cc1NC(=O)c1cccnc1)-c1cccs1