Reaction Details
TargetHistone deacetylase 6
LigandBDBM50374007
Substrate/Competitorn/a
Meas. Tech.ChEMBL_468839 (CHEMBL947926)
IC50>50000±n/a nM
Citation Methot, JLChakravarty, PKChenard, MClose, JCruz, JCDahlberg, WKFleming, JHamblett, CLHamill, JEHarrington, PHarsch, AHeidebrecht, RHughes, BJung, JKenific, CMKral, AMMeinke, PTMiddleton, REOzerova, NSloman, DLStanton, MGSzewczak, AATyagarajan, SWitter, DJSecrist, JPMiller, TA Exploration of the internal cavity of histone deacetylase (HDAC) with selective HDAC1/HDAC2 inhibitors (SHI-1:2). Bioorg Med Chem Lett18:973-8 (2008) 
 
Histone deacetylase 6
Name:Histone deacetylase 6
Type:Chromatin regulator; hydrolase; repressor
Mol. Mass.:131381.51
Organism:Homo sapiens (Human)
Description:Q9UBN7
Residue:1215
BDBM50374007
NameBDBM50374007
Synonyms:CHEMBL271949
TypeSmall organic molecule
Emp. Form.C17H14N2OS
Mol. Mass.294.371
SMILESNc1ccc(cc1NC(=O)c1ccccc1)-c1cccs1