Reaction Details
TargetHistone deacetylase 2
LigandBDBM50232005
Substrate/Competitorn/a
Meas. Tech.ChEMBL_468835 (CHEMBL947922)
IC50 200±n/a nM
Citation Methot, JLChakravarty, PKChenard, MClose, JCruz, JCDahlberg, WKFleming, JHamblett, CLHamill, JEHarrington, PHarsch, AHeidebrecht, RHughes, BJung, JKenific, CMKral, AMMeinke, PTMiddleton, REOzerova, NSloman, DLStanton, MGSzewczak, AATyagarajan, SWitter, DJSecrist, JPMiller, TA Exploration of the internal cavity of histone deacetylase (HDAC) with selective HDAC1/HDAC2 inhibitors (SHI-1:2). Bioorg Med Chem Lett18:973-8 (2008) 
 
Histone deacetylase 2
Name:Histone deacetylase 2
Type:Chromatin regulator; hydrolase; repressor
Mol. Mass.:55356.54
Organism:Homo sapiens (Human)
Description:Q92769
Residue:488
BDBM50232005
NameBDBM50232005
Synonyms:CHEMBL269935 N-(4-hydroxybiphenyl-3-yl)benzamide
TypeSmall organic molecule
Emp. Form.C19H15NO2
Mol. Mass.289.3279
SMILESOc1ccc(cc1NC(=O)c1ccccc1)-c1ccccc1