Reaction Details
TargetHistamine H3 receptor
LigandBDBM50374107
Substrate/Competitorn/a
Meas. Tech.ChEMBL_468943 (CHEMBL930591)
Ki 0.9±n/a nM
Citation Santora, VJCovel, JAHayashi, RHofilena, BJIbarra, JBPulley, MDWeinhouse, MISengupta, DDuffield, JJSemple, GWebb, RRSage, CRen, APereira, GKnudsen, JEdwards, JESuarez, MFrazer, JThomsen, WHauser, EWhelan, KGrottick, AJ A new family of H3 receptor antagonists based on the natural product Conessine. Bioorg Med Chem Lett18:1490-4 (2008) 
 
Histamine H3 receptor
Name:Histamine H3 receptor
Type:G Protein-Coupled Receptor (GPCR)
Mol. Mass.:48607.98
Organism:Rattus norvegicus (rat)
Description:n/a
Residue:445
BDBM50374107
NameBDBM50374107
Synonyms:CHEMBL270440
TypeSmall organic molecule
Emp. Form.C22H32N2
Mol. Mass.324.5029
SMILESCC(C)N1CC2CC=C(C2C1)c1ccc(CCN2CCCC2)cc1