Reaction Details
TargetPotassium voltage-gated channel subfamily H member 2
LigandBDBM50374938
Substrate/Competitorn/a
Meas. Tech.ChEMBL_470090 (CHEMBL933468)
IC50 7100±n/a nM
Citation Edmondson, SDWei, LXu, JShang, JXu, SPang, JChaudhary, ADean, DCHe, HLeiting, BLyons, KAPatel, RAPatel, SBScapin, GWu, JKBeconi, MGThornberry, NAWeber, AE Fluoroolefins as amide bond mimics in dipeptidyl peptidase IV inhibitors. Bioorg Med Chem Lett18:2409-13 (2008) 
 
Potassium voltage-gated channel subfamily H member 2
Name:Potassium voltage-gated channel subfamily H member 2
Type:Multi-pass membrane protein
Mol. Mass.:126672.65
Organism:Homo sapiens (Human)
Description:Q12809
Residue:1159
BDBM50374938
NameBDBM50374938
Synonyms:CHEMBL402163
TypeSmall organic molecule
Emp. Form.C21H25ClFN3O3S
Mol. Mass.453.958
SMILES[#6]S(=O)(=O)c1ccc(-c2noc(n2)-[#6@@H](-[#6]-[#6]-2-[#6]-[#6]-2)-[#6@H](-[#7])-[#6](\F)=[#6]-2/[#6]-[#6]-[#6]-[#6]-2)c(Cl)c1