Reaction Details
TargetPotassium voltage-gated channel subfamily H member 2
LigandBDBM50237207
Substrate/Competitorn/a
Meas. Tech.ChEMBL_470090 (CHEMBL933468)
IC50 19000±n/a nM
Citation Edmondson, SDWei, LXu, JShang, JXu, SPang, JChaudhary, ADean, DCHe, HLeiting, BLyons, KAPatel, RAPatel, SBScapin, GWu, JKBeconi, MGThornberry, NAWeber, AE Fluoroolefins as amide bond mimics in dipeptidyl peptidase IV inhibitors. Bioorg Med Chem Lett18:2409-13 (2008) 
 
Potassium voltage-gated channel subfamily H member 2
Name:Potassium voltage-gated channel subfamily H member 2
Type:Multi-pass membrane protein
Mol. Mass.:126672.65
Organism:Homo sapiens (Human)
Description:Q12809
Residue:1159
BDBM50237207
NameBDBM50237207
Synonyms:(2S)-3-(3-(2-chloro-4-(methylsulfonyl)phenyl)-1,2,4-oxadiazol-5-yl)-1-cyclopentylidene-1-fluorobutan-2-amine 2,2,2-trifluoroacetate CHEMBL257023
TypeSmall organic molecule
Emp. Form.C18H21ClFN3O3S
Mol. Mass.413.894
SMILES[#6]-[#6](-[#6@H](-[#7])-[#6](\F)=[#6]-1/[#6]-[#6]-[#6]-[#6]-1)-c1nc(no1)-c1ccc(cc1Cl)S([#6])(=O)=O