Reaction Details
TargetDipeptidyl peptidase 4
LigandBDBM11681
Substrate/Competitorn/a
Meas. Tech.ChEMBL_470078 (CHEMBL933456)
IC50 19±n/a nM
Citation Edmondson, SDWei, LXu, JShang, JXu, SPang, JChaudhary, ADean, DCHe, HLeiting, BLyons, KAPatel, RAPatel, SBScapin, GWu, JKBeconi, MGThornberry, NAWeber, AE Fluoroolefins as amide bond mimics in dipeptidyl peptidase IV inhibitors. Bioorg Med Chem Lett18:2409-13 (2008) 
 
Dipeptidyl peptidase 4
Name:Dipeptidyl peptidase 4
Type:Enzyme
Mol. Mass.:88271.01
Organism:Homo sapiens (Human)
Description:P27487
Residue:766
BDBM11681
NameBDBM11681
Synonyms:(2S,3S)-4-cyclopropyl-3-[3-(2-fluoro-4-methanesulfonylphenyl)-1,2,4-oxadiazol-5-yl]-1-[(3S)-3-fluoropyrrolidin-1-yl]-1-oxobutan-2-aminium; 2,2,2-trifluoroacetate oxadiazole based amide
TypeSmall organic molecule
Emp. Form.C20H25F2N4O4S
Mol. Mass.455.498
SMILESCS(=O)(=O)c1ccc(-c2noc(n2)[C@@H](CC2CC2)[C@H]([NH3+])C(=O)N2CC[C@H](F)C2)c(F)c1