Reaction Details
TargetDipeptidyl peptidase 4
LigandBDBM50374940
Substrate/Competitorn/a
Meas. Tech.ChEMBL_470078 (CHEMBL933456)
IC50 93±n/a nM
Citation Edmondson, SDWei, LXu, JShang, JXu, SPang, JChaudhary, ADean, DCHe, HLeiting, BLyons, KAPatel, RAPatel, SBScapin, GWu, JKBeconi, MGThornberry, NAWeber, AE Fluoroolefins as amide bond mimics in dipeptidyl peptidase IV inhibitors. Bioorg Med Chem Lett18:2409-13 (2008) 
 
Dipeptidyl peptidase 4
Name:Dipeptidyl peptidase 4
Type:Enzyme
Mol. Mass.:88271.01
Organism:Homo sapiens (Human)
Description:P27487
Residue:766
BDBM50374940
NameBDBM50374940
Synonyms:CHEMBL255591
TypeSmall organic molecule
Emp. Form.C19H23ClFN3O4S
Mol. Mass.443.92
SMILES[#6]S(=O)(=O)c1ccc(-c2noc(n2)-[#6@H](-[#6]-[#6]-[#8])-[#6@H](-[#7])-[#6](\F)=[#6]-2/[#6]-[#6]-[#6]-[#6]-2)c(Cl)c1