Reaction Details
TargetDipeptidyl peptidase 4
LigandBDBM50374945
Substrate/Competitorn/a
Meas. Tech.ChEMBL_470078 (CHEMBL933456)
IC50 1490±n/a nM
Citation Edmondson, SDWei, LXu, JShang, JXu, SPang, JChaudhary, ADean, DCHe, HLeiting, BLyons, KAPatel, RAPatel, SBScapin, GWu, JKBeconi, MGThornberry, NAWeber, AE Fluoroolefins as amide bond mimics in dipeptidyl peptidase IV inhibitors. Bioorg Med Chem Lett18:2409-13 (2008) 
 
Dipeptidyl peptidase 4
Name:Dipeptidyl peptidase 4
Type:Enzyme
Mol. Mass.:88271.01
Organism:Homo sapiens (Human)
Description:P27487
Residue:766
BDBM50374945
NameBDBM50374945
Synonyms:CHEMBL401932
TypeSmall organic molecule
Emp. Form.C18H19F4N3O3S
Mol. Mass.433.42
SMILES[#6]-[#6](-[#6@H](-[#7])-[#6](\F)=[#6]-1/[#6]-[#6]-[#6]-[#6]-1)-c1nc(no1)-c1ccc(cc1)S(=O)(=O)C(F)(F)F