Reaction Details
TargetDipeptidyl peptidase 4
LigandBDBM11666
Substrate/Competitorn/a
Meas. Tech.ChEMBL_470078 (CHEMBL933456)
IC50 17±n/a nM
Citation Edmondson, SDWei, LXu, JShang, JXu, SPang, JChaudhary, ADean, DCHe, HLeiting, BLyons, KAPatel, RAPatel, SBScapin, GWu, JKBeconi, MGThornberry, NAWeber, AE Fluoroolefins as amide bond mimics in dipeptidyl peptidase IV inhibitors. Bioorg Med Chem Lett18:2409-13 (2008) 
 
Dipeptidyl peptidase 4
Name:Dipeptidyl peptidase 4
Type:Enzyme
Mol. Mass.:88271.01
Organism:Homo sapiens (Human)
Description:P27487
Residue:766
BDBM11666
NameBDBM11666
Synonyms:(2S,3S)-2-amino-3-[3-(2-chloro-4-methanesulfonylphenyl)-1,2,4-oxadiazol-5-yl]-1-(pyrrolidin-1-yl)butan-1-one alpha-amino acid pyrrolidide 28 | oxadiazole based amide
TypeSmall organic molecule
Emp. Form.C17H21ClN4O4S
Mol. Mass.412.891
SMILESC[C@@H]([C@H](N)C(=O)N1CCCC1)c1nc(no1)-c1ccc(cc1Cl)S(C)(=O)=O