Reaction Details
TargetDipeptidyl peptidase 4
LigandBDBM11662
Substrate/Competitorn/a
Meas. Tech.ChEMBL_470078 (CHEMBL933456)
IC50 203±n/a nM
Citation Edmondson, SDWei, LXu, JShang, JXu, SPang, JChaudhary, ADean, DCHe, HLeiting, BLyons, KAPatel, RAPatel, SBScapin, GWu, JKBeconi, MGThornberry, NAWeber, AE Fluoroolefins as amide bond mimics in dipeptidyl peptidase IV inhibitors. Bioorg Med Chem Lett18:2409-13 (2008) 
 
Dipeptidyl peptidase 4
Name:Dipeptidyl peptidase 4
Type:Enzyme
Mol. Mass.:88271.01
Organism:Homo sapiens (Human)
Description:P27487
Residue:766
BDBM11662
NameBDBM11662
Synonyms:(2S,3S)-2-amino-3-[3-(2,4-dichlorophenyl)-1,2,4-oxadiazol-5-yl]-1-(pyrrolidin-1-yl)butan-1-one alpha-amino acid pyrrolidide 24 | oxadiazole based amide
TypeSmall organic molecule
Emp. Form.C16H18Cl2N4O2
Mol. Mass.369.246
SMILESC[C@@H]([C@H](N)C(=O)N1CCCC1)c1nc(no1)-c1ccc(Cl)cc1Cl