Reaction Details
TargetDipeptidyl peptidase 2
LigandBDBM50374940
Substrate/Competitorn/a
Meas. Tech.ChEMBL_470079 (CHEMBL933457)
IC50 1400±n/a nM
Citation Edmondson, SDWei, LXu, JShang, JXu, SPang, JChaudhary, ADean, DCHe, HLeiting, BLyons, KAPatel, RAPatel, SBScapin, GWu, JKBeconi, MGThornberry, NAWeber, AE Fluoroolefins as amide bond mimics in dipeptidyl peptidase IV inhibitors. Bioorg Med Chem Lett18:2409-13 (2008) 
 
Dipeptidyl peptidase 2
Name:Dipeptidyl peptidase 2
Type:Protein
Mol. Mass.:54339.29
Organism:Homo sapiens (Human)
Description:Q9UHL4
Residue:492
BDBM50374940
NameBDBM50374940
Synonyms:CHEMBL255591
TypeSmall organic molecule
Emp. Form.C19H23ClFN3O4S
Mol. Mass.443.92
SMILES[#6]S(=O)(=O)c1ccc(-c2noc(n2)-[#6@H](-[#6]-[#6]-[#8])-[#6@H](-[#7])-[#6](\F)=[#6]-2/[#6]-[#6]-[#6]-[#6]-2)c(Cl)c1