Reaction Details
TargetDipeptidyl peptidase 2
LigandBDBM50374942
Substrate/Competitorn/a
Meas. Tech.ChEMBL_470079 (CHEMBL933457)
IC50 460±n/a nM
Citation Edmondson, SDWei, LXu, JShang, JXu, SPang, JChaudhary, ADean, DCHe, HLeiting, BLyons, KAPatel, RAPatel, SBScapin, GWu, JKBeconi, MGThornberry, NAWeber, AE Fluoroolefins as amide bond mimics in dipeptidyl peptidase IV inhibitors. Bioorg Med Chem Lett18:2409-13 (2008) 
 
Dipeptidyl peptidase 2
Name:Dipeptidyl peptidase 2
Type:Protein
Mol. Mass.:54339.29
Organism:Homo sapiens (Human)
Description:Q9UHL4
Residue:492
BDBM50374942
NameBDBM50374942
Synonyms:CHEMBL1162974
TypeSmall organic molecule
Emp. Form.C18H20ClFN2O3S
Mol. Mass.398.879
SMILES[#6]-[#6](-[#6]-c1nc(no1)-c1ccc(cc1Cl)S([#6])(=O)=O)-[#6](\F)=[#6]-1/[#6]-[#6]-[#6]-[#6]-1