Reaction Details
TargetDipeptidyl peptidase 2
LigandBDBM50374947
Substrate/Competitorn/a
Meas. Tech.ChEMBL_470079 (CHEMBL933457)
IC50 140±n/a nM
Citation Edmondson, SDWei, LXu, JShang, JXu, SPang, JChaudhary, ADean, DCHe, HLeiting, BLyons, KAPatel, RAPatel, SBScapin, GWu, JKBeconi, MGThornberry, NAWeber, AE Fluoroolefins as amide bond mimics in dipeptidyl peptidase IV inhibitors. Bioorg Med Chem Lett18:2409-13 (2008) 
 
Dipeptidyl peptidase 2
Name:Dipeptidyl peptidase 2
Type:Protein
Mol. Mass.:54339.29
Organism:Homo sapiens (Human)
Description:Q9UHL4
Residue:492
BDBM50374947
NameBDBM50374947
Synonyms:CHEMBL256603
TypeSmall organic molecule
Emp. Form.C17H18BrClFN3O
Mol. Mass.414.7
SMILES[#6]-[#6](-[#6@H](-[#7])-[#6](\F)=[#6]-1/[#6]-[#6]-[#6]-[#6]-1)-c1nc(no1)-c1ccc(Br)cc1Cl