Reaction Details
TargetDipeptidyl peptidase 2
LigandBDBM50374948
Substrate/Competitorn/a
Meas. Tech.ChEMBL_470079 (CHEMBL933457)
IC50 1660±n/a nM
Citation Edmondson, SDWei, LXu, JShang, JXu, SPang, JChaudhary, ADean, DCHe, HLeiting, BLyons, KAPatel, RAPatel, SBScapin, GWu, JKBeconi, MGThornberry, NAWeber, AE Fluoroolefins as amide bond mimics in dipeptidyl peptidase IV inhibitors. Bioorg Med Chem Lett18:2409-13 (2008) 
 
Dipeptidyl peptidase 2
Name:Dipeptidyl peptidase 2
Type:Protein
Mol. Mass.:54339.29
Organism:Homo sapiens (Human)
Description:Q9UHL4
Residue:492
BDBM50374948
NameBDBM50374948
Synonyms:CHEMBL255351
TypeSmall organic molecule
Emp. Form.C18H18ClF4N3O
Mol. Mass.403.802
SMILES[#6]-[#6](-[#6@H](-[#7])-[#6](\F)=[#6]-1/[#6]-[#6]-[#6]-[#6]-1)-c1nc(no1)-c1ccc(cc1Cl)C(F)(F)F