Reaction Details
TargetDipeptidyl peptidase 2
LigandBDBM11678
Substrate/Competitorn/a
Meas. Tech.ChEMBL_470079 (CHEMBL933457)
IC50 45000±n/a nM
Citation Edmondson, SDWei, LXu, JShang, JXu, SPang, JChaudhary, ADean, DCHe, HLeiting, BLyons, KAPatel, RAPatel, SBScapin, GWu, JKBeconi, MGThornberry, NAWeber, AE Fluoroolefins as amide bond mimics in dipeptidyl peptidase IV inhibitors. Bioorg Med Chem Lett18:2409-13 (2008) 
 
Dipeptidyl peptidase 2
Name:Dipeptidyl peptidase 2
Type:Protein
Mol. Mass.:54339.29
Organism:Homo sapiens (Human)
Description:Q9UHL4
Residue:492
BDBM11678
NameBDBM11678
Synonyms:(2S,3S)-3-[3-(2-chloro-4-methanesulfonylphenyl)-1,2,4-oxadiazol-5-yl]-1-[(3S)-3-fluoropyrrolidin-1-yl]-5-hydroxy-1-oxopentan-2-aminium; 2,2,2-trifluoroacetate oxadiazole based amide
TypeSmall organic molecule
Emp. Form.C18H23ClFN4O5S
Mol. Mass.461.915
SMILESCS(=O)(=O)c1ccc(-c2noc(n2)[C@@H](CCO)[C@H]([NH3+])C(=O)N2CC[C@H](F)C2)c(Cl)c1