Reaction Details
TargetDipeptidyl peptidase 2
LigandBDBM11666
Substrate/Competitorn/a
Meas. Tech.ChEMBL_470079 (CHEMBL933457)
IC50 6400±n/a nM
Citation Edmondson, SDWei, LXu, JShang, JXu, SPang, JChaudhary, ADean, DCHe, HLeiting, BLyons, KAPatel, RAPatel, SBScapin, GWu, JKBeconi, MGThornberry, NAWeber, AE Fluoroolefins as amide bond mimics in dipeptidyl peptidase IV inhibitors. Bioorg Med Chem Lett18:2409-13 (2008) 
 
Dipeptidyl peptidase 2
Name:Dipeptidyl peptidase 2
Type:Protein
Mol. Mass.:54339.29
Organism:Homo sapiens (Human)
Description:Q9UHL4
Residue:492
BDBM11666
NameBDBM11666
Synonyms:(2S,3S)-2-amino-3-[3-(2-chloro-4-methanesulfonylphenyl)-1,2,4-oxadiazol-5-yl]-1-(pyrrolidin-1-yl)butan-1-one alpha-amino acid pyrrolidide 28 | oxadiazole based amide
TypeSmall organic molecule
Emp. Form.C17H21ClN4O4S
Mol. Mass.412.891
SMILESC[C@@H]([C@H](N)C(=O)N1CCCC1)c1nc(no1)-c1ccc(cc1Cl)S(C)(=O)=O