Reaction Details
TargetMacrophage colony-stimulating factor 1 receptor
LigandBDBM50375135
Substrate/Competitorn/a
Meas. Tech.ChEMBL_470263 (CHEMBL950218)
IC50 2300±n/a nM
Citation Huang, HHutta, DAHu, HDesJarlais, RLSchubert, CPetrounia, IPChaikin, MAManthey, CLPlayer, MR Design and synthesis of a pyrido[2,3-d]pyrimidin-5-one class of anti-inflammatory FMS inhibitors. Bioorg Med Chem Lett18:2355-61 (2008) 
 
Macrophage colony-stimulating factor 1 receptor
Name:Macrophage colony-stimulating factor 1 receptor
Type:Protein
Mol. Mass.:107979.48
Organism:Homo sapiens (Human)
Description:P07333
Residue:972
BDBM50375135
NameBDBM50375135
Synonyms:CHEMBL257318
TypeSmall organic molecule
Emp. Form.C23H23N7O2
Mol. Mass.429.4744
SMILESNC(=O)c1cn(-c2ccc3CCCc3c2)c2nc(NCCCn3ccnc3)ncc2c1=O