Reaction Details
TargetVascular endothelial growth factor receptor 2
LigandBDBM50375205
Substrate/Competitorn/a
Meas. Tech.ChEMBL_470295 (CHEMBL950347)
IC50 2±n/a nM
Citation Underiner, TLRuggeri, BAimone, LAlbom, MAngeles, TChang, HHudkins, RLHunter, KJosef, KRobinson, CWeinberg, LYang, SZulli, A TIE-2/VEGF-R2 SAR and in vitro activity of C3-acyl dihydroindazolo[5,4-a]pyrrolo[3,4-c]carbazole analogs. Bioorg Med Chem Lett18:2368-72 (2008) 
 
Vascular endothelial growth factor receptor 2
Name:Vascular endothelial growth factor receptor 2
Type:Receptor Tyrosine Kinase
Mol. Mass.:151510.97
Organism:Homo sapiens (Human)
Description:P35968
Residue:1356
BDBM50375205
NameBDBM50375205
Synonyms:CHEMBL428876
TypeSmall organic molecule
Emp. Form.C25H18N4O2S
Mol. Mass.438.501
SMILESCn1cc-2c(CCc3c-2c2C(=O)NCc2c2c4cc(ccc4[nH]c32)C(=O)c2cccs2)n1