Reaction Details
Target3-hydroxy-3-methylglutaryl-coenzyme A reductase
LigandBDBM50226162
Substrate/Competitorn/a
Meas. Tech.ChEMBL_470908 (CHEMBL937006)
IC50 16900±n/a nM
Citation Pak, VVKoo, MKim, MJYun, LKwon, DY Binding effect and design of a competitive inhibitory peptide for HMG-CoA reductase through modeling of an active peptide backbone. Bioorg Med Chem16:1309-18 (2008) 
 
3-hydroxy-3-methylglutaryl-coenzyme A reductase
Name:3-hydroxy-3-methylglutaryl-coenzyme A reductase
Type:PROTEIN
Mol. Mass.:96954.46
Organism:Mesocricetus auratus
Description:ChEMBL_470908
Residue:887
BDBM50226162
NameBDBM50226162
Synonyms:CHEMBL258999 | GFPTGG
TypeSmall organic molecule
Emp. Form.C24H34N6O8
Mol. Mass.534.5622
SMILESC[C@@H](O)[C@H](NC(=O)[C@@H]1CCCN1C(=O)[C@H](Cc1ccccc1)NC(=O)CN)C(=O)NCC(=O)NCC(O)=O