Reaction Details
Target3-hydroxy-3-methylglutaryl-coenzyme A reductase
LigandBDBM50226166
Substrate/Competitorn/a
Meas. Tech.ChEMBL_470908 (CHEMBL937006)
IC50 3800±n/a nM
Citation Pak, VVKoo, MKim, MJYun, LKwon, DY Binding effect and design of a competitive inhibitory peptide for HMG-CoA reductase through modeling of an active peptide backbone. Bioorg Med Chem16:1309-18 (2008) 
 
3-hydroxy-3-methylglutaryl-coenzyme A reductase
Name:3-hydroxy-3-methylglutaryl-coenzyme A reductase
Type:PROTEIN
Mol. Mass.:96954.46
Organism:Mesocricetus auratus
Description:ChEMBL_470908
Residue:887
BDBM50226166
NameBDBM50226166
Synonyms:CHEMBL258583 F(4-fluro)VAE
TypeSmall organic molecule
Emp. Form.C22H31FN4O7
Mol. Mass.482.5025
SMILESCC(C)[C@H](NC(=O)[C@@H](N)Cc1ccc(F)cc1)C(=O)N[C@@H](C)C(=O)N[C@@H](CCC(O)=O)C(O)=O