Reaction Details
TargetSucrase-isomaltase, intestinal
LigandBDBM50016703
Substrate/Competitorn/a
Meas. Tech.ChEMBL_472706 (CHEMBL923890)
IC50 16000±n/a nM
Citation Minami, YKuriyama, CIkeda, KKato, ATakebayashi, KAdachi, IFleet, GWKettawan, AOkamoto, TAsano, N Effect of five-membered sugar mimics on mammalian glycogen-degrading enzymes and various glucosidases. Bioorg Med Chem16:2734-40 (2008) 
 
Sucrase-isomaltase, intestinal
Name:Sucrase-isomaltase, intestinal
Type:Enzyme
Mol. Mass.:210329.04
Organism:Rattus norvegicus (Rat)
Description:P23739
Residue:1841
BDBM50016703
NameBDBM50016703
Synonyms:2-Hydroxymethyl-pyrrolidine-3,4-diol CHEMBL80254 | Imino-D-Arabinitol
TypeSmall organic molecule
Emp. Form.C5H11NO3
Mol. Mass.133.1457
SMILESOC[C@H]1NC[C@@H](O)[C@@H]1O