Reaction Details
TargetG-protein coupled bile acid receptor 1
LigandBDBM50375575
Substrate/Competitorn/a
Meas. Tech.ChEMBL_472949 (CHEMBL949256)
EC50 47800±n/a nM
Citation Sato, HMacchiarulo, AThomas, CGioiello, AUne, MHofmann, AFSaladin, RSchoonjans, KPellicciari, RAuwerx, J Novel potent and selective bile acid derivatives as TGR5 agonists: biological screening, structure-activity relationships, and molecular modeling studies. J Med Chem51:1831-41 (2008) 
 
G-protein coupled bile acid receptor 1
Name:G-protein coupled bile acid receptor 1
Type:G Protein-Coupled Receptor (GPCR)
Mol. Mass.:35260.02
Organism:Homo sapiens (Human)
Description:CHO cells transiently transfected with hTGR5.
Residue:330
BDBM50375575
NameBDBM50375575
Synonyms:CHEMBL270493
TypeSmall organic molecule
Emp. Form.C26H45NO8S2
Mol. Mass.563.767
SMILESC[C@H](CCC(=O)NCCS(O)(=O)=O)[C@H]1CC[C@H]2[C@@H]3CC[C@@H]4C[C@@H](CC[C@]4(C)[C@H]3CC[C@]12C)OS(O)(=O)=O