Reaction Details
TargetG-protein coupled bile acid receptor 1
LigandBDBM50375594
Substrate/Competitorn/a
Meas. Tech.ChEMBL_472949 (CHEMBL949256)
EC50 4950±n/a nM
Citation Sato, HMacchiarulo, AThomas, CGioiello, AUne, MHofmann, AFSaladin, RSchoonjans, KPellicciari, RAuwerx, J Novel potent and selective bile acid derivatives as TGR5 agonists: biological screening, structure-activity relationships, and molecular modeling studies. J Med Chem51:1831-41 (2008) 
 
G-protein coupled bile acid receptor 1
Name:G-protein coupled bile acid receptor 1
Type:G Protein-Coupled Receptor (GPCR)
Mol. Mass.:35260.02
Organism:Homo sapiens (Human)
Description:CHO cells transiently transfected with hTGR5.
Residue:330
BDBM50375594
NameBDBM50375594
Synonyms:TAUROCHOLATE
TypeSmall organic molecule
Emp. Form.C26H45NO7S
Mol. Mass.515.703
SMILESC[C@H](CCC(=O)NCCS(O)(=O)=O)[C@H]1CC[C@H]2[C@@H]3[C@H](O)C[C@@H]4C[C@H](O)CC[C@]4(C)[C@H]3C[C@H](O)[C@]12C