Reaction Details
TargetGeranylgeranyl pyrophosphate synthase BTS1
LigandBDBM12578
Substrate/Competitorn/a
Meas. Tech.ChEMBL_474165 (CHEMBL938423)
IC50 660±n/a nM
Citation Guo, RTCao, RLiang, PHKo, TPChang, THHudock, MPJeng, WYChen, CKZhang, YSong, YKuo, CJYin, FOldfield, EWang, AH Bisphosphonates target multiple sites in both cis- and trans-prenyltransferases. Proc Natl Acad Sci U S A104:10022-7 (2007) 
 
Geranylgeranyl pyrophosphate synthase BTS1
Name:Geranylgeranyl pyrophosphate synthase BTS1
Type:Protein
Mol. Mass.:38647.44
Organism:Saccharomyces cerevisiae (Yeast)
Description:n/a
Residue:335
BDBM12578
NameBDBM12578
Synonyms:2-(imidazol-1-yl)-1-hydroxyethylidene-1,1-bisphosphonic acid CGP-42446 JMC515594 Compound 55 US11279719, Example Zolendronic acid (ZOL) Zoledronate [1-hydroxy-2-(1H-imidazol-1-yl)-1-phosphonoethyl]phosphonic acid | zoledronic acid
TypeSmall organic molecule
Emp. Form.C5H10N2O7P2
Mol. Mass.272.0896
SMILESOC(Cn1ccnc1)(P(O)(O)=O)P(O)(O)=O