Reaction Details
TargetGeranylgeranyl pyrophosphate synthase BTS1
LigandBDBM25266
Substrate/Competitorn/a
Meas. Tech.ChEMBL_474166 (CHEMBL938424)
Ki 30±n/a nM
Citation Guo, RTCao, RLiang, PHKo, TPChang, THHudock, MPJeng, WYChen, CKZhang, YSong, YKuo, CJYin, FOldfield, EWang, AH Bisphosphonates target multiple sites in both cis- and trans-prenyltransferases. Proc Natl Acad Sci U S A104:10022-7 (2007) 
 
Geranylgeranyl pyrophosphate synthase BTS1
Name:Geranylgeranyl pyrophosphate synthase BTS1
Type:Protein
Mol. Mass.:38647.44
Organism:Saccharomyces cerevisiae (Yeast)
Description:n/a
Residue:335
BDBM25266
NameBDBM25266
Synonyms:BPH-628 {1-hydroxy-2-[3-(4-phenylphenyl)phenyl]-1-phosphonoethyl}phosphonic acid
TypeSmall organic molecule
Emp. Form.C20H20O7P2
Mol. Mass.434.3161
SMILESOC(Cc1cccc(c1)-c1ccc(cc1)-c1ccccc1)(P(O)(O)=O)P(O)(O)=O