Reaction Details
TargetEstrogen receptor beta
LigandBDBM50154137
Substrate/Competitorn/a
Meas. Tech.ChEMBL_475716 (CHEMBL934602)
IC50 1±n/a nM
Citation Crisman, TJBender, AMilik, MJenkins, JLScheiber, JSukuru, SCFejzo, JHommel, UDavies, JWGlick, M "Virtual fragment linking": an approach to identify potent binders from low affinity fragment hits. J Med Chem51:2481-91 (2008) 
 
Estrogen receptor beta
Name:Estrogen receptor beta
Type:Protein
Mol. Mass.:59238.43
Organism:Homo sapiens (Human)
Description:Q92731
Residue:530
BDBM50154137
NameBDBM50154137
Synonyms:3-(6-HYDROXY-NAPHTHALEN-2-YL)-BENZO[D]ISOOXAZOL-6-OL 3-(6-hydroxynaphthalen-2-yl)benzo[d]isoxazol-6-ol | CHEMBL187105
TypeSmall organic molecule
Emp. Form.C17H11NO3
Mol. Mass.277.2741
SMILESOc1ccc2c(noc2c1)-c1ccc2cc(O)ccc2c1