Reaction Details
TargetC-C chemokine receptor type 2
LigandBDBM50377030
Substrate/Competitorn/a
Meas. Tech.ChEMBL_479245 (CHEMBL932555)
IC50 10±n/a nM
Citation Xia, MHou, CDemong, DPollack, SPan, MBrackley, JSinger, MMatheis, MCavender, DWachter, M Substituted dipiperidine alcohols as potent CCR2 antagonists. Bioorg Med Chem Lett18:3562-4 (2008) 
 
C-C chemokine receptor type 2
Name:C-C chemokine receptor type 2
Type:Enzyme
Mol. Mass.:41932.32
Organism:Homo sapiens (Human)
Description:P41597
Residue:374
BDBM50377030
NameBDBM50377030
Synonyms:CHEMBL255500
TypeSmall organic molecule
Emp. Form.C30H34F3N3O3
Mol. Mass.541.6045
SMILESCOc1cccc2c(c[nH]c12)C1CCN(CC1)C(CO)C1CCN(CC1)C(=O)\C=C\c1cc(F)c(F)c(F)c1