Reaction Details
TargetInterleukin-1 receptor-associated kinase 4
LigandBDBM50377165
Substrate/Competitorn/a
Meas. Tech.ChEMBL_479339 (CHEMBL921622)
IC50 2±n/a nM
Citation Buckley, GMFosbeary, RFraser, JLGowers, LHigueruelo, APJames, LAJenkins, KMack, SRMorgan, TParry, DMPitt, WRRausch, ORichard, MDSabin, V IRAK-4 inhibitors. Part III: a series of imidazo[1,2-a]pyridines. Bioorg Med Chem Lett18:3656-60 (2008) 
 
Interleukin-1 receptor-associated kinase 4
Name:Interleukin-1 receptor-associated kinase 4
Type:Protein
Mol. Mass.:51519.08
Organism:Homo sapiens (Human)
Description:Q9NWZ3
Residue:460
BDBM50377165
NameBDBM50377165
Synonyms:CHEMBL255867
TypeSmall organic molecule
Emp. Form.C20H21N7
Mol. Mass.359.4276
SMILESC1CC(CCN1)Nc1cccc(n1)-c1cnc2ccc(cn12)-c1cc[nH]n1