Reaction Details
TargetInterleukin-1 receptor-associated kinase 4
LigandBDBM50377172
Substrate/Competitorn/a
Meas. Tech.ChEMBL_479339 (CHEMBL921622)
IC50 10±n/a nM
Citation Buckley, GMFosbeary, RFraser, JLGowers, LHigueruelo, APJames, LAJenkins, KMack, SRMorgan, TParry, DMPitt, WRRausch, ORichard, MDSabin, V IRAK-4 inhibitors. Part III: a series of imidazo[1,2-a]pyridines. Bioorg Med Chem Lett18:3656-60 (2008) 
 
Interleukin-1 receptor-associated kinase 4
Name:Interleukin-1 receptor-associated kinase 4
Type:Protein
Mol. Mass.:51519.08
Organism:Homo sapiens (Human)
Description:Q9NWZ3
Residue:460
BDBM50377172
NameBDBM50377172
Synonyms:CHEMBL404473
TypeSmall organic molecule
Emp. Form.C18H21N5
Mol. Mass.307.3928
SMILESCc1ccc2ncn(-c3cccc(NC4CCNCC4)n3)c2c1