Reaction Details
TargetEpidermal growth factor receptor
LigandBDBM50240214
Substrate/Competitorn/a
Meas. Tech.ChEMBL_479448 (CHEMBL934832)
IC50 8±n/a nM
Citation Xu, GSearle, LLHughes, TVBeck, AKConnolly, PJAbad, MCNeeper, MPStruble, GTSpringer, BAEmanuel, SLGruninger, RHPandey, NAdams, MMoreno-Mazza, SFuentes-Pesquera, ARMiddleton, SAGreenberger, LM Discovery of novel 4-amino-6-arylaminopyrimidine-5-carbaldehyde oximes as dual inhibitors of EGFR and ErbB-2 protein tyrosine kinases. Bioorg Med Chem Lett18:3495-9 (2008) 
 
Epidermal growth factor receptor
Name:Epidermal growth factor receptor
Type:Receptor Kinase Domain
Mol. Mass.:134279.59
Organism:Homo sapiens (Human)
Description:P00533
Residue:1210
BDBM50240214
NameBDBM50240214
Synonyms:4-(1-(3-fluorobenzyl)-1H-indazol-5-ylamino)-6-aminopyrimidine-5-carbaldehyde O-methyl oxime | CHEMBL255871
TypeSmall organic molecule
Emp. Form.C20H18FN7O
Mol. Mass.391.4016
SMILESCO\N=C\c1c(N)ncnc1Nc1ccc2n(Cc3cccc(F)c3)ncc2c1