Reaction Details
TargetCoagulation factor X
LigandBDBM50377648
Substrate/Competitorn/a
Meas. Tech.ChEMBL_479811 (CHEMBL930381)
Ki 43±n/a nM
Citation Corte, JRFang, TPinto, DJHan, WHu, ZJiang, XJLi, YLGauuan, JFHadden, MOrton, DRendina, ARLuettgen, JMWong, PCHe, KMorin, PEChang, CHCheney, DLKnabb, RMWexler, RRLam, PY Structure-activity relationships of anthranilamide-based factor Xa inhibitors containing piperidinone and pyridinone P4 moieties. Bioorg Med Chem Lett18:2845-9 (2008) 
 
Coagulation factor X
Name:Coagulation factor X
Type:Enzyme
Mol. Mass.:54726.60
Organism:Homo sapiens (Human)
Description:n/a
Residue:488
BDBM50377648
NameBDBM50377648
Synonyms:CHEMBL260911
TypeSmall organic molecule
Emp. Form.C24H18N4O3
Mol. Mass.410.4247
SMILESO=C(Nc1ccccc1C(=O)Nc1cccnc1)c1ccc(cc1)-n1ccccc1=O