Reaction Details
TargetCoagulation factor X
LigandBDBM50377650
Substrate/Competitorn/a
Meas. Tech.ChEMBL_479811 (CHEMBL930381)
Ki 1.2±n/a nM
Citation Corte, JRFang, TPinto, DJHan, WHu, ZJiang, XJLi, YLGauuan, JFHadden, MOrton, DRendina, ARLuettgen, JMWong, PCHe, KMorin, PEChang, CHCheney, DLKnabb, RMWexler, RRLam, PY Structure-activity relationships of anthranilamide-based factor Xa inhibitors containing piperidinone and pyridinone P4 moieties. Bioorg Med Chem Lett18:2845-9 (2008) 
 
Coagulation factor X
Name:Coagulation factor X
Type:Enzyme
Mol. Mass.:54726.60
Organism:Homo sapiens (Human)
Description:n/a
Residue:488
BDBM50377650
NameBDBM50377650
Synonyms:CHEMBL260354
TypeSmall organic molecule
Emp. Form.C24H21ClN4O3
Mol. Mass.448.902
SMILESClc1ccc(NC(=O)c2ccccc2NC(=O)c2ccc(cc2)N2CCCCC2=O)nc1