Reaction Details
TargetFarnesyl pyrophosphate synthase
LigandBDBM50377836
Substrate/Competitorn/a
Meas. Tech.ChEMBL_480067 (CHEMBL929343)
IC50 629.5±n/a nM
Citation Deprèle, SKashemirov, BAHogan, JMEbetino, FHBarnett, BLEvdokimov, AMcKenna, CE Farnesyl pyrophosphate synthase enantiospecificity with a chiral risedronate analog, [6,7-dihydro-5H-cyclopenta[c]pyridin-7-yl(hydroxy)methylene]bis(phosphonic acid) (NE-10501): Synthetic, structural, and modeling studies. Bioorg Med Chem Lett18:2878-82 (2008) 
 
Farnesyl pyrophosphate synthase
Name:Farnesyl pyrophosphate synthase
Type:Enzyme
Mol. Mass.:48272.89
Organism:Homo sapiens (Human)
Description:P14324
Residue:419
BDBM50377836
NameBDBM50377836
Synonyms:CHEMBL317573
TypeSmall organic molecule
Emp. Form.C9H13NO7P2
Mol. Mass.309.1495
SMILESOC(C1CCc2ccncc12)(P(O)(O)=O)P(O)(O)=O