Reaction Details
TargetGonadotropin-releasing hormone receptor
LigandBDBM50162007
Substrate/Competitorn/a
Meas. Tech.ChEMBL_480123 (CHEMBL923765)
Ki 0.56±n/a nM
Citation Zhao, LGuo, ZChen, YHu, TWu, DZhu, YFRowbottom, MGross, TDTucci, FCStruthers, RSXie, QChen, C 5-Aryluracils as potent GnRH antagonists-Characterization of atropisomers. Bioorg Med Chem Lett18:3344-9 (2008) 
 
Gonadotropin-releasing hormone receptor
Name:Gonadotropin-releasing hormone receptor
Type:Enzyme
Mol. Mass.:37749.45
Organism:Homo sapiens (Human)
Description:P30968
Residue:328
BDBM50162007
NameBDBM50162007
Synonyms:(R)-1-(2,6-difluorobenzyl)-3-(2-amino-2-phenylethyl)-5-(2-fluoro-3-methoxyphenyl)-6-methylpyrimidine-2,4(1H,3H)-dione 3-[(2R)-amino-2-phenylethyl]-1-(2,6-difluorobenzyl)-5-(2-fluoro-3-methoxyphenyl)-6-methylpyrimidin-2,4-dione | CHEMBL179691
TypeSmall organic molecule
Emp. Form.C27H24F3N3O3
Mol. Mass.495.493
SMILESCOc1cccc(c1F)-c1c(C)n(Cc2c(F)cccc2F)c(=O)n(C[C@H](N)c2ccccc2)c1=O