Reaction Details
TargetProstaglandin G/H synthase 2
LigandBDBM50057527
Substrate/Competitorn/a
Meas. Tech.ChEMBL_480247 (CHEMBL1020816)
IC50 0.45±n/a nM
Citation Su, BNCuendet, MHawthorne, MEKardono, LBRiswan, SFong, HHMehta, RGPezzuto, JMKinghorn, AD Constituents of the bark and twigs of Artocarpus dadah with cyclooxygenase inhibitory activity. J Nat Prod65:163-9 (2002) Prostaglandin G/H synthase 2
Name:Prostaglandin G/H synthase 2
Type:Enzyme
Mol. Mass.:69003.89
Organism:Homo sapiens (Human)
Description:Recombinant Cox-2 provided by Cayman (Cayman Chemical Co.,Ann Arbor, MI).
Residue:604
BDBM50057527
NameBDBM50057527
Synonyms:4-(5-(4-chlorophenyl)-3-(trifluoromethyl)-1H-pyrazol-1-yl)benzenesulfonamide CHEMBL282093 | SC-58236
TypeSmall organic molecule
Emp. Form.C16H11ClF3N3O2S
Mol. Mass.401.791
SMILESNS(=O)(=O)c1ccc(cc1)-n1nc(cc1-c1ccc(Cl)cc1)C(F)(F)F