Reaction Details
TargetProstaglandin G/H synthase 1
LigandBDBM50250915
Substrate/Competitorn/a
Meas. Tech.ChEMBL_480246 (CHEMBL1020815)
IC50 500±n/a nM
Citation Su, BNCuendet, MHawthorne, MEKardono, LBRiswan, SFong, HHMehta, RGPezzuto, JMKinghorn, AD Constituents of the bark and twigs of Artocarpus dadah with cyclooxygenase inhibitory activity. J Nat Prod65:163-9 (2002) Prostaglandin G/H synthase 1
Name:Prostaglandin G/H synthase 1
Type:Enzyme
Mol. Mass.:68692.62
Organism:Homo sapiens (Human)
Description:P23219
Residue:599
BDBM50250915
NameBDBM50250915
Synonyms:CHEMBL512578 | moracin M
TypeSmall organic molecule
Emp. Form.C14H10O4
Mol. Mass.242.2268
SMILESOc1ccc2cc(oc2c1)-c1cc(O)cc(O)c1