Reaction Details
TargetProstaglandin G/H synthase 2
LigandBDBM23926
Substrate/Competitorn/a
Meas. Tech.ChEMBL_480247 (CHEMBL1020816)
IC50 1300±n/a nM
Citation Su, BNCuendet, MHawthorne, MEKardono, LBRiswan, SFong, HHMehta, RGPezzuto, JMKinghorn, AD Constituents of the bark and twigs of Artocarpus dadah with cyclooxygenase inhibitory activity. J Nat Prod65:163-9 (2002) Prostaglandin G/H synthase 2
Name:Prostaglandin G/H synthase 2
Type:Enzyme
Mol. Mass.:69003.89
Organism:Homo sapiens (Human)
Description:Recombinant Cox-2 provided by Cayman (Cayman Chemical Co.,Ann Arbor, MI).
Residue:604
BDBM23926
NameBDBM23926
Synonyms:(E)-resveratrol CHEMBL165 Stilbene, 2f cid_445154 trans-resveratrol
TypeSmall organic molecule
Emp. Form.C14H12O3
Mol. Mass.228.2433
SMILESOc1ccc(\C=C\c2cc(O)cc(O)c2)cc1